{"text_format":"1","workbook":"xlsx","n_sheets":9,"sheets":["Agency Contact List","Objectives (IC,LO,PSC)","Tasks (Planning)","Air Sorties Status Board (AOBD)","Ground Sorties Status Board (GB","Overview","Comm Log","Resources (Staging Mngr)","SAVE"],"not_rendered":{"charts":0,"images":0,"macros":0,"external_links":0,"defined_names":2,"comments":2,"pivot_tables":0},"unopened":[],"bounds":{"document_bytes":16777216,"sheet_cells":100000,"rows_first":2000,"rows_last":500,"rows_between":2000,"halvings":0,"cell_chars":16384,"cell_head_chars":4096},"cells_cut":0,"cells_raw":0,"read":"whole","date_system":"1900"}

{"sheet":"Agency Contact List","index":0,"n_rows":10,"n_cols":11,"rows_kept":10,"cut":false,"hidden":false,"merged":[[0,0,0,1],[0,2,0,4],[0,9,0,10],[0,6,0,7]]}
[" ",null,null,null,null,"Date:",null,null,"Op Period"]
["Agency","Customer Tracking","Contact Name","Title","Assigned LO","Email","Phone 1","Phone 2","Email","Fax","Notes"]
["NOC","NOC"]
["FEMA","FMA"]
["ATC","ATC"]
["CAP Relo","CAP"]
["AFRCC","AFR"]
[]
[]
[null,null,"  "]

{"sheet":"Objectives (IC,LO,PSC)","index":1,"n_rows":25,"n_cols":14,"rows_kept":25,"cut":false,"hidden":false,"merged":[[0,6,0,10],[1,8,1,12],[1,13,2,13],[0,0,0,1],[0,3,0,4],[1,7,2,7],[1,0,2,0],[1,1,2,1],[1,6,2,6],[1,5,2,5],[1,4,2,4],[1,3,2,3]]}
["Mission #",null,null,{"$f":"'Agency Contact List'!C1","v":0},null,"Mission Objective:",null,null,null,null,null,"Date:",{"$f":"'Agency Contact List'!G1","v":"00:00:00"}]
["Customer","Request #",null,"Priority\n(H, M, L)","Date/Time Rec'd (z)","Request Description","Details/Information","Mission Num | Ref. Sorties","Time Status All Entries (zulu)",null,null,null,null,"Result"]
[null,null,null,null,null,null,null,null,"Deadline","Assigned","Started","Complete","Agency/Contact"]
[]
[]
[]
[]
[null,null,{"$f":"A8&B8","v":""},null,null,null,null,null,null,null,null,null,{"$f":"IFERROR(VLOOKUP(A8,'Agency Contact List'!B:G,2,FALSE),\"\")","v":""}]
[null,null,"",null,null,null,null,null,null,null,null,null,{"$f":"IFERROR(VLOOKUP(A9,'Agency Contact List'!B:G,2,FALSE),\"\")","v":""}]
[null,null,"",null,null,null,null,null,null,null,null,null,{"$f":"IFERROR(VLOOKUP(A10,'Agency Contact List'!B:G,2,FALSE),\"\")","v":""}]
[null,null,"",null,null,null,null,null,null,null,null,null,{"$f":"IFERROR(VLOOKUP(A11,'Agency Contact List'!B:G,2,FALSE),\"\")","v":""}]
[null,null,"",null,null,null,null,null,null,null,null,null,{"$f":"IFERROR(VLOOKUP(A12,'Agency Contact List'!B:G,2,FALSE),\"\")","v":""}]
[null,null,"",null,null,null,null,null,null,null,null,null,{"$f":"IFERROR(VLOOKUP(A13,'Agency Contact List'!B:G,2,FALSE),\"\")","v":""}]
[null,null,"",null,null,null,null,null,null,null,null,null,{"$f":"IFERROR(VLOOKUP(A14,'Agency Contact List'!B:G,2,FALSE),\"\")","v":""}]
[null,null,"",null,null,null,null,null,null,null,null,null,{"$f":"IFERROR(VLOOKUP(A15,'Agency Contact List'!B:G,2,FALSE),\"\")","v":""}]
[null,null,"",null,null,null,null,null,null,null,null,null,{"$f":"IFERROR(VLOOKUP(A16,'Agency Contact List'!B:G,2,FALSE),\"\")","v":""}]
[null,null,"",null,null,null,null,null,null,null,null,null,{"$f":"IFERROR(VLOOKUP(A17,'Agency Contact List'!B:G,2,FALSE),\"\")","v":""}]
[null,null,"",null,null,null,null,null,null,null,null,null,{"$f":"IFERROR(VLOOKUP(A18,'Agency Contact List'!B:G,2,FALSE),\"\")","v":""}]
[null,null,"",null,null,null,null,null,null,null,null,null,{"$f":"IFERROR(VLOOKUP(A19,'Agency Contact List'!B:G,2,FALSE),\"\")","v":""}]
[null,null,"",null,null,null,null,null,null,null,null,null,{"$f":"IFERROR(VLOOKUP(A20,'Agency Contact List'!B:G,2,FALSE),\"\")","v":""}]
[null,null,"",null,null,null,null,null,null,null,null,null,{"$f":"IFERROR(VLOOKUP(A21,'Agency Contact List'!B:G,2,FALSE),\"\")","v":""}]
[null,null,"",null,null,null,null,null,null,null,null,null,{"$f":"IFERROR(VLOOKUP(A22,'Agency Contact List'!B:G,2,FALSE),\"\")","v":""}]
[null,null,"",null,null,null,null,null,null,null,null,null,{"$f":"IFERROR(VLOOKUP(A23,'Agency Contact List'!B:G,2,FALSE),\"\")","v":""}]
[null,null,"",null,null,null,null,null,null,null,null,null,{"$f":"IFERROR(VLOOKUP(A24,'Agency Contact List'!B:G,2,FALSE),\"\")","v":""}]
[null,null,"",null,null,null,null,null,null,null,null,null,{"$f":"IFERROR(VLOOKUP(A25,'Agency Contact List'!B:G,2,FALSE),\"\")","v":""}]

{"sheet":"Tasks (Planning)","index":2,"n_rows":49,"n_cols":13,"rows_kept":49,"cut":false,"hidden":false,"merged":[[2,12,3,12],[1,5,2,6],[0,0,0,4],[1,0,2,4],[0,9,0,10],[1,7,1,10],[2,7,2,10]]}
[null,null,null,null,null,null,"REQUEST #:",null,"Date:",{"$f":"'Agency Contact List'!G1","v":"00:00:00"}]
["OBJECTIVE:",null,null,null,null,null,null,{"$f":"NOW()","v":"2020-02-08T13:07:13.630"}]
[null,null,null,null,null,null,null,"T I M E",null,null,null,null,"RESULTS"]
["Objective #","Task",null,"Priority\n(L-M-H)","Date/Time Rec'd (z)","DUE DATE\nmm/dd ##:##z","TASK DESCRIPTION","Assigned to OSC","First Sortie Assigned\n","Task Completed by Ops","Customer Notified/ Complete","Sortie #s"]
[]
[]
[]
[]
[]
[]
[]
[]
[]
[]
[]
[]
[]
[]
[]
[null,null,{"$f":"A20&B20","v":""}]
[null,null,""]
[null,null,""]
[null,null,""]
[null,null,""]
[null,null,""]
[null,null,""]
[null,null,""]
[null,null,""]
[null,null,""]
[null,null,""]
[null,null,""]
[null,null,""]
[null,null,""]
[null,null,""]
[null,null,""]
[null,null,""]
[null,null,""]
[null,null,""]
[null,null,""]
[null,null,""]
{"$rows_left_out":10}
{"sheet":"Air Sorties Status Board (AOBD)","index":3,"n_rows":2,"n_cols":15,"rows_kept":2,"cut":false,"hidden":false,"merged":[[0,13,0,14],[0,0,0,12]]}
["AIR OPS STATUS BOARD",null,null,null,null,null,null,null,null,null,null,null,null,{"$f":"NOW()","v":"2020-02-08T13:07:13.630"}]
["Date","Task #","WMIRS SORTIE","TAIL #","Call Sign","PIC/Phone#","Mission Tasking & GRID","Hours of Fuel on Board","ETD Z","ATD Z","ETA Z","ATA\nZ","Last Check-in","Remarks","Status\n(use drop down)"]

{"sheet":"Ground Sorties Status Board (GB","index":4,"n_rows":2,"n_cols":13,"rows_kept":2,"cut":false,"hidden":false,"merged":[[0,11,0,12],[0,0,0,10]]}
["GROUND STATUS BOARD",null,null,null,null,null,null,null,null,null,null,{"$f":"NOW()","v":"2020-02-08T13:07:13.630"}]
["Date","Task #","WMIRS Sortie #","GT Call Sign","GTL/Phone #","Mission Tasking & GRID","ETD Z","ATD Z","ETA Z","ATA Z","Last Check-in","Remarks","Status\n(use drop down)"]

{"sheet":"Overview","index":5,"n_rows":50,"n_cols":10,"rows_kept":50,"cut":false,"hidden":false,"merged":[[0,0,0,4],[0,6,0,9]]}
["Aircraft",null,null,null,null,null,"Ground Team"]
["Tail #","Call Sign","Sortie #","Pilot Info ","Sortie Status",null,"Call Sign","Sortie #","GTL","Sortie Status"]
[{"$f":"'Air Sorties Status Board (AOBD)'!D3","v":0},{"$f":"'Air Sorties Status Board (AOBD)'!E3","v":0},{"$f":"'Air Sorties Status Board (AOBD)'!C3","v":0},{"$f":"'Air Sorties Status Board (AOBD)'!F3","v":0},{"$f":"'Air Sorties Status Board (AOBD)'!O3","v":0},null,{"$f":"'Ground Sorties Status Board (GB'!D3","v":0},{"$f":"'Ground Sorties Status Board (GB'!C3","v":0},{"$f":"'Ground Sorties Status Board (GB'!E3","v":0},{"$f":"'Ground Sorties Status Board (GB'!M3","v":0}]
[{"$f":"'Air Sorties Status Board (AOBD)'!D4","v":0},{"$f":"'Air Sorties Status Board (AOBD)'!E4","v":0},{"$f":"'Air Sorties Status Board (AOBD)'!C4","v":0},{"$f":"'Air Sorties Status Board (AOBD)'!F4","v":0},{"$f":"'Air Sorties Status Board (AOBD)'!O4","v":0},null,{"$f":"'Ground Sorties Status Board (GB'!D4","v":0},{"$f":"'Ground Sorties Status Board (GB'!C4","v":0},{"$f":"'Ground Sorties Status Board (GB'!E4","v":0},{"$f":"'Ground Sorties Status Board (GB'!M4","v":0}]
[{"$f":"'Air Sorties Status Board (AOBD)'!D5","v":0},{"$f":"'Air Sorties Status Board (AOBD)'!E5","v":0},{"$f":"'Air Sorties Status Board (AOBD)'!C5","v":0},{"$f":"'Air Sorties Status Board (AOBD)'!F5","v":0},{"$f":"'Air Sorties Status Board (AOBD)'!O5","v":0},null,{"$f":"'Ground Sorties Status Board (GB'!D5","v":0},{"$f":"'Ground Sorties Status Board (GB'!C5","v":0},{"$f":"'Ground Sorties Status Board (GB'!E5","v":0},{"$f":"'Ground Sorties Status Board (GB'!M5","v":0}]
[{"$f":"'Air Sorties Status Board (AOBD)'!D6","v":0},{"$f":"'Air Sorties Status Board (AOBD)'!E6","v":0},{"$f":"'Air Sorties Status Board (AOBD)'!C6","v":0},{"$f":"'Air Sorties Status Board (AOBD)'!F6","v":0},{"$f":"'Air Sorties Status Board (AOBD)'!O6","v":0},null,{"$f":"'Ground Sorties Status Board (GB'!D6","v":0},{"$f":"'Ground Sorties Status Board (GB'!C6","v":0},{"$f":"'Ground Sorties Status Board (GB'!E6","v":0},{"$f":"'Ground Sorties Status Board (GB'!M6","v":0}]
[{"$f":"'Air Sorties Status Board (AOBD)'!D7","v":0},{"$f":"'Air Sorties Status Board (AOBD)'!E7","v":0},{"$f":"'Air Sorties Status Board (AOBD)'!C7","v":0},{"$f":"'Air Sorties Status Board (AOBD)'!F7","v":0},{"$f":"'Air Sorties Status Board (AOBD)'!O7","v":0},null,{"$f":"'Ground Sorties Status Board (GB'!D7","v":0},{"$f":"'Ground Sorties Status Board (GB'!C7","v":0},{"$f":"'Ground Sorties Status Board (GB'!E7","v":0},{"$f":"'Ground Sorties Status Board (GB'!M7","v":0}]
[{"$f":"'Air Sorties Status Board (AOBD)'!D8","v":0},{"$f":"'Air Sorties Status Board (AOBD)'!E8","v":0},{"$f":"'Air Sorties Status Board (AOBD)'!C8","v":0},{"$f":"'Air Sorties Status Board (AOBD)'!F8","v":0},{"$f":"'Air Sorties Status Board (AOBD)'!O8","v":0},null,{"$f":"'Ground Sorties Status Board (GB'!D8","v":0},{"$f":"'Ground Sorties Status Board (GB'!C8","v":0},{"$f":"'Ground Sorties Status Board (GB'!E8","v":0},{"$f":"'Ground Sorties Status Board (GB'!M8","v":0}]
[{"$f":"'Air Sorties Status Board (AOBD)'!D9","v":0},{"$f":"'Air Sorties Status Board (AOBD)'!E9","v":0},{"$f":"'Air Sorties Status Board (AOBD)'!C9","v":0},{"$f":"'Air Sorties Status Board (AOBD)'!F9","v":0},{"$f":"'Air Sorties Status Board (AOBD)'!O9","v":0},null,{"$f":"'Ground Sorties Status Board (GB'!D9","v":0},{"$f":"'Ground Sorties Status Board (GB'!C9","v":0},{"$f":"'Ground Sorties Status Board (GB'!E9","v":0},{"$f":"'Ground Sorties Status Board (GB'!M9","v":0}]
[{"$f":"'Air Sorties Status Board (AOBD)'!D10","v":0},{"$f":"'Air Sorties Status Board (AOBD)'!E10","v":0},{"$f":"'Air Sorties Status Board (AOBD)'!C10","v":0},{"$f":"'Air Sorties Status Board (AOBD)'!F10","v":0},{"$f":"'Air Sorties Status Board (AOBD)'!O10","v":0},null,{"$f":"'Ground Sorties Status Board (GB'!D10","v":0},{"$f":"'Ground Sorties Status Board (GB'!C10","v":0},{"$f":"'Ground Sorties Status Board (GB'!E10","v":0},{"$f":"'Ground Sorties Status Board (GB'!M10","v":0}]
[{"$f":"'Air Sorties Status Board (AOBD)'!D11","v":0},{"$f":"'Air Sorties Status Board (AOBD)'!E11","v":0},{"$f":"'Air Sorties Status Board (AOBD)'!C11","v":0},{"$f":"'Air Sorties Status Board (AOBD)'!F11","v":0},{"$f":"'Air Sorties Status Board (AOBD)'!O11","v":0},null,{"$f":"'Ground Sorties Status Board (GB'!D11","v":0},{"$f":"'Ground Sorties Status Board (GB'!C11","v":0},{"$f":"'Ground Sorties Status Board (GB'!E11","v":0},{"$f":"'Ground Sorties Status Board (GB'!M11","v":0}]
[{"$f":"'Air Sorties Status Board (AOBD)'!D12","v":0},{"$f":"'Air Sorties Status Board (AOBD)'!E12","v":0},{"$f":"'Air Sorties Status Board (AOBD)'!C12","v":0},{"$f":"'Air Sorties Status Board (AOBD)'!F12","v":0},{"$f":"'Air Sorties Status Board (AOBD)'!O12","v":0},null,{"$f":"'Ground Sorties Status Board (GB'!D12","v":0},{"$f":"'Ground Sorties Status Board (GB'!C12","v":0},{"$f":"'Ground Sorties Status Board (GB'!E12","v":0},{"$f":"'Ground Sorties Status Board (GB'!M12","v":0}]
[{"$f":"'Air Sorties Status Board (AOBD)'!D13","v":0},{"$f":"'Air Sorties Status Board (AOBD)'!E13","v":0},{"$f":"'Air Sorties Status Board (AOBD)'!C13","v":0},{"$f":"'Air Sorties Status Board (AOBD)'!F13","v":0},{"$f":"'Air Sorties Status Board (AOBD)'!O13","v":0},null,{"$f":"'Ground Sorties Status Board (GB'!D13","v":0},{"$f":"'Ground Sorties Status Board (GB'!C13","v":0},{"$f":"'Ground Sorties Status Board (GB'!E13","v":0},{"$f":"'Ground Sorties Status Board (GB'!M13","v":0}]
[{"$f":"'Air Sorties Status Board (AOBD)'!D14","v":0},{"$f":"'Air Sorties Status Board (AOBD)'!E14","v":0},{"$f":"'Air Sorties Status Board (AOBD)'!C14","v":0},{"$f":"'Air Sorties Status Board (AOBD)'!F14","v":0},{"$f":"'Air Sorties Status Board (AOBD)'!O14","v":0},null,{"$f":"'Ground Sorties Status Board (GB'!D14","v":0},{"$f":"'Ground Sorties Status Board (GB'!C14","v":0},{"$f":"'Ground Sorties Status Board (GB'!E14","v":0},{"$f":"'Ground Sorties Status Board (GB'!M14","v":0}]
[{"$f":"'Air Sorties Status Board (AOBD)'!D15","v":0},{"$f":"'Air Sorties Status Board (AOBD)'!E15","v":0},{"$f":"'Air Sorties Status Board (AOBD)'!C15","v":0},{"$f":"'Air Sorties Status Board (AOBD)'!F15","v":0},{"$f":"'Air Sorties Status Board (AOBD)'!O15","v":0},null,{"$f":"'Ground Sorties Status Board (GB'!D15","v":0},{"$f":"'Ground Sorties Status Board (GB'!C15","v":0},{"$f":"'Ground Sorties Status Board (GB'!E15","v":0},{"$f":"'Ground Sorties Status Board (GB'!M15","v":0}]
[{"$f":"'Air Sorties Status Board (AOBD)'!D16","v":0},{"$f":"'Air Sorties Status Board (AOBD)'!E16","v":0},{"$f":"'Air Sorties Status Board (AOBD)'!C16","v":0},{"$f":"'Air Sorties Status Board (AOBD)'!F16","v":0},{"$f":"'Air Sorties Status Board (AOBD)'!O16","v":0},null,{"$f":"'Ground Sorties Status Board (GB'!D16","v":0},{"$f":"'Ground Sorties Status Board (GB'!C16","v":0},{"$f":"'Ground Sorties Status Board (GB'!E16","v":0},{"$f":"'Ground Sorties Status Board (GB'!M16","v":0}]
[{"$f":"'Air Sorties Status Board (AOBD)'!D17","v":0},{"$f":"'Air Sorties Status Board (AOBD)'!E17","v":0},{"$f":"'Air Sorties Status Board (AOBD)'!C17","v":0},{"$f":"'Air Sorties Status Board (AOBD)'!F17","v":0},{"$f":"'Air Sorties Status Board (AOBD)'!O17","v":0},null,{"$f":"'Ground Sorties Status Board (GB'!D17","v":0},{"$f":"'Ground Sorties Status Board (GB'!C17","v":0},{"$f":"'Ground Sorties Status Board (GB'!E17","v":0},{"$f":"'Ground Sorties Status Board (GB'!M17","v":0}]
[{"$f":"'Air Sorties Status Board (AOBD)'!D18","v":0},{"$f":"'Air Sorties Status Board (AOBD)'!E18","v":0},{"$f":"'Air Sorties Status Board (AOBD)'!C18","v":0},{"$f":"'Air Sorties Status Board (AOBD)'!F18","v":0},{"$f":"'Air Sorties Status Board (AOBD)'!O18","v":0},null,{"$f":"'Ground Sorties Status Board (GB'!D18","v":0},{"$f":"'Ground Sorties Status Board (GB'!C18","v":0},{"$f":"'Ground Sorties Status Board (GB'!E18","v":0},{"$f":"'Ground Sorties Status Board (GB'!M18","v":0}]
[{"$f":"'Air Sorties Status Board (AOBD)'!D19","v":0},{"$f":"'Air Sorties Status Board (AOBD)'!E19","v":0},{"$f":"'Air Sorties Status Board (AOBD)'!C19","v":0},{"$f":"'Air Sorties Status Board (AOBD)'!F19","v":0},{"$f":"'Air Sorties Status Board (AOBD)'!O19","v":0},null,{"$f":"'Ground Sorties Status Board (GB'!D19","v":0},{"$f":"'Ground Sorties Status Board (GB'!C19","v":0},{"$f":"'Ground Sorties Status Board (GB'!E19","v":0},{"$f":"'Ground Sorties Status Board (GB'!M19","v":0}]
[{"$f":"'Air Sorties Status Board (AOBD)'!D20","v":0},{"$f":"'Air Sorties Status Board (AOBD)'!E20","v":0},{"$f":"'Air Sorties Status Board (AOBD)'!C20","v":0},{"$f":"'Air Sorties Status Board (AOBD)'!F20","v":0},{"$f":"'Air Sorties Status Board (AOBD)'!O20","v":0},null,{"$f":"'Ground Sorties Status Board (GB'!D20","v":0},{"$f":"'Ground Sorties Status Board (GB'!C20","v":0},{"$f":"'Ground Sorties Status Board (GB'!E20","v":0},{"$f":"'Ground Sorties Status Board (GB'!M20","v":0}]
[{"$f":"'Air Sorties Status Board (AOBD)'!D21","v":0},{"$f":"'Air Sorties Status Board (AOBD)'!E21","v":0},{"$f":"'Air Sorties Status Board (AOBD)'!C21","v":0},{"$f":"'Air Sorties Status Board (AOBD)'!F21","v":0},{"$f":"'Air Sorties Status Board (AOBD)'!O21","v":0},null,{"$f":"'Ground Sorties Status Board (GB'!D21","v":0},{"$f":"'Ground Sorties Status Board (GB'!C21","v":0},{"$f":"'Ground Sorties Status Board (GB'!E21","v":0},{"$f":"'Ground Sorties Status Board (GB'!M21","v":0}]
[{"$f":"'Air Sorties Status Board (AOBD)'!D22","v":0},{"$f":"'Air Sorties Status Board (AOBD)'!E22","v":0},{"$f":"'Air Sorties Status Board (AOBD)'!C22","v":0},{"$f":"'Air Sorties Status Board (AOBD)'!F22","v":0},{"$f":"'Air Sorties Status Board (AOBD)'!O22","v":0},null,{"$f":"'Ground Sorties Status Board (GB'!D22","v":0},{"$f":"'Ground Sorties Status Board (GB'!C22","v":0},{"$f":"'Ground Sorties Status Board (GB'!E22","v":0},{"$f":"'Ground Sorties Status Board (GB'!M22","v":0}]
[{"$f":"'Air Sorties Status Board (AOBD)'!D23","v":0},{"$f":"'Air Sorties Status Board (AOBD)'!E23","v":0},{"$f":"'Air Sorties Status Board (AOBD)'!C23","v":0},{"$f":"'Air Sorties Status Board (AOBD)'!F23","v":0},{"$f":"'Air Sorties Status Board (AOBD)'!O23","v":0},null,{"$f":"'Ground Sorties Status Board (GB'!D23","v":0},{"$f":"'Ground Sorties Status Board (GB'!C23","v":0},{"$f":"'Ground Sorties Status Board (GB'!E23","v":0},{"$f":"'Ground Sorties Status Board (GB'!M23","v":0}]
[{"$f":"'Air Sorties Status Board (AOBD)'!D24","v":0},{"$f":"'Air Sorties Status Board (AOBD)'!E24","v":0},{"$f":"'Air Sorties Status Board (AOBD)'!C24","v":0},{"$f":"'Air Sorties Status Board (AOBD)'!F24","v":0},{"$f":"'Air Sorties Status Board (AOBD)'!O24","v":0},null,{"$f":"'Ground Sorties Status Board (GB'!D24","v":0},{"$f":"'Ground Sorties Status Board (GB'!C24","v":0},{"$f":"'Ground Sorties Status Board (GB'!E24","v":0},{"$f":"'Ground Sorties Status Board (GB'!M24","v":0}]
[{"$f":"'Air Sorties Status Board (AOBD)'!D25","v":0},{"$f":"'Air Sorties Status Board (AOBD)'!E25","v":0},{"$f":"'Air Sorties Status Board (AOBD)'!C25","v":0},{"$f":"'Air Sorties Status Board (AOBD)'!F25","v":0},{"$f":"'Air Sorties Status Board (AOBD)'!O25","v":0},null,{"$f":"'Ground Sorties Status Board (GB'!D25","v":0},{"$f":"'Ground Sorties Status Board (GB'!C25","v":0},{"$f":"'Ground Sorties Status Board (GB'!E25","v":0},{"$f":"'Ground Sorties Status Board (GB'!M25","v":0}]
[{"$f":"'Air Sorties Status Board (AOBD)'!D26","v":0},{"$f":"'Air Sorties Status Board (AOBD)'!E26","v":0},{"$f":"'Air Sorties Status Board (AOBD)'!C26","v":0},{"$f":"'Air Sorties Status Board (AOBD)'!F26","v":0},{"$f":"'Air Sorties Status Board (AOBD)'!O26","v":0},null,{"$f":"'Ground Sorties Status Board (GB'!D26","v":0},{"$f":"'Ground Sorties Status Board (GB'!C26","v":0},{"$f":"'Ground Sorties Status Board (GB'!E26","v":0},{"$f":"'Ground Sorties Status Board (GB'!M26","v":0}]
[{"$f":"'Air Sorties Status Board (AOBD)'!D27","v":0},{"$f":"'Air Sorties Status Board (AOBD)'!E27","v":0},{"$f":"'Air Sorties Status Board (AOBD)'!C27","v":0},{"$f":"'Air Sorties Status Board (AOBD)'!F27","v":0},{"$f":"'Air Sorties Status Board (AOBD)'!O27","v":0},null,{"$f":"'Ground Sorties Status Board (GB'!D27","v":0},{"$f":"'Ground Sorties Status Board (GB'!C27","v":0},{"$f":"'Ground Sorties Status Board (GB'!E27","v":0},{"$f":"'Ground Sorties Status Board (GB'!M27","v":0}]
[{"$f":"'Air Sorties Status Board (AOBD)'!D28","v":0},{"$f":"'Air Sorties Status Board (AOBD)'!E28","v":0},{"$f":"'Air Sorties Status Board (AOBD)'!C28","v":0},{"$f":"'Air Sorties Status Board (AOBD)'!F28","v":0},{"$f":"'Air Sorties Status Board (AOBD)'!O28","v":0},null,{"$f":"'Ground Sorties Status Board (GB'!D28","v":0},{"$f":"'Ground Sorties Status Board (GB'!C28","v":0},{"$f":"'Ground Sorties Status Board (GB'!E28","v":0},{"$f":"'Ground Sorties Status Board (GB'!M28","v":0}]
[{"$f":"'Air Sorties Status Board (AOBD)'!D29","v":0},{"$f":"'Air Sorties Status Board (AOBD)'!E29","v":0},{"$f":"'Air Sorties Status Board (AOBD)'!C29","v":0},{"$f":"'Air Sorties Status Board (AOBD)'!F29","v":0},{"$f":"'Air Sorties Status Board (AOBD)'!O29","v":0},null,{"$f":"'Ground Sorties Status Board (GB'!D29","v":0},{"$f":"'Ground Sorties Status Board (GB'!C29","v":0},{"$f":"'Ground Sorties Status Board (GB'!E29","v":0},{"$f":"'Ground Sorties Status Board (GB'!M29","v":0}]
[{"$f":"'Air Sorties Status Board (AOBD)'!D30","v":0},{"$f":"'Air Sorties Status Board (AOBD)'!E30","v":0},{"$f":"'Air Sorties Status Board (AOBD)'!C30","v":0},{"$f":"'Air Sorties Status Board (AOBD)'!F30","v":0},{"$f":"'Air Sorties Status Board (AOBD)'!O30","v":0},null,{"$f":"'Ground Sorties Status Board (GB'!D30","v":0},{"$f":"'Ground Sorties Status Board (GB'!C30","v":0},{"$f":"'Ground Sorties Status Board (GB'!E30","v":0},{"$f":"'Ground Sorties Status Board (GB'!M30","v":0}]
[{"$f":"'Air Sorties Status Board (AOBD)'!D31","v":0},{"$f":"'Air Sorties Status Board (AOBD)'!E31","v":0},{"$f":"'Air Sorties Status Board (AOBD)'!C31","v":0},{"$f":"'Air Sorties Status Board (AOBD)'!F31","v":0},{"$f":"'Air Sorties Status Board (AOBD)'!O31","v":0},null,{"$f":"'Ground Sorties Status Board (GB'!D31","v":0},{"$f":"'Ground Sorties Status Board (GB'!C31","v":0},{"$f":"'Ground Sorties Status Board (GB'!E31","v":0},{"$f":"'Ground Sorties Status Board (GB'!M31","v":0}]
[{"$f":"'Air Sorties Status Board (AOBD)'!D32","v":0},{"$f":"'Air Sorties Status Board (AOBD)'!E32","v":0},{"$f":"'Air Sorties Status Board (AOBD)'!C32","v":0},{"$f":"'Air Sorties Status Board (AOBD)'!F32","v":0},{"$f":"'Air Sorties Status Board (AOBD)'!O32","v":0},null,{"$f":"'Ground Sorties Status Board (GB'!D32","v":0},{"$f":"'Ground Sorties Status Board (GB'!C32","v":0},{"$f":"'Ground Sorties Status Board (GB'!E32","v":0},{"$f":"'Ground Sorties Status Board (GB'!M32","v":0}]
[{"$f":"'Air Sorties Status Board (AOBD)'!D33","v":0},{"$f":"'Air Sorties Status Board (AOBD)'!E33","v":0},{"$f":"'Air Sorties Status Board (AOBD)'!C33","v":0},{"$f":"'Air Sorties Status Board (AOBD)'!F33","v":0},{"$f":"'Air Sorties Status Board (AOBD)'!O33","v":0},null,{"$f":"'Ground Sorties Status Board (GB'!D33","v":0},{"$f":"'Ground Sorties Status Board (GB'!C33","v":0},{"$f":"'Ground Sorties Status Board (GB'!E33","v":0},{"$f":"'Ground Sorties Status Board (GB'!M33","v":0}]
[{"$f":"'Air Sorties Status Board (AOBD)'!D34","v":0},{"$f":"'Air Sorties Status Board (AOBD)'!E34","v":0},{"$f":"'Air Sorties Status Board (AOBD)'!C34","v":0},{"$f":"'Air Sorties Status Board (AOBD)'!F34","v":0},{"$f":"'Air Sorties Status Board (AOBD)'!O34","v":0},null,{"$f":"'Ground Sorties Status Board (GB'!D34","v":0},{"$f":"'Ground Sorties Status Board (GB'!C34","v":0},{"$f":"'Ground Sorties Status Board (GB'!E34","v":0},{"$f":"'Ground Sorties Status Board (GB'!M34","v":0}]
[{"$f":"'Air Sorties Status Board (AOBD)'!D35","v":0},{"$f":"'Air Sorties Status Board (AOBD)'!E35","v":0},{"$f":"'Air Sorties Status Board (AOBD)'!C35","v":0},{"$f":"'Air Sorties Status Board (AOBD)'!F35","v":0},{"$f":"'Air Sorties Status Board (AOBD)'!O35","v":0},null,{"$f":"'Ground Sorties Status Board (GB'!D35","v":0},{"$f":"'Ground Sorties Status Board (GB'!C35","v":0},{"$f":"'Ground Sorties Status Board (GB'!E35","v":0},{"$f":"'Ground Sorties Status Board (GB'!M35","v":0}]
[{"$f":"'Air Sorties Status Board (AOBD)'!D36","v":0},{"$f":"'Air Sorties Status Board (AOBD)'!E36","v":0},{"$f":"'Air Sorties Status Board (AOBD)'!C36","v":0},{"$f":"'Air Sorties Status Board (AOBD)'!F36","v":0},{"$f":"'Air Sorties Status Board (AOBD)'!O36","v":0},null,{"$f":"'Ground Sorties Status Board (GB'!D36","v":0},{"$f":"'Ground Sorties Status Board (GB'!C36","v":0},{"$f":"'Ground Sorties Status Board (GB'!E36","v":0},{"$f":"'Ground Sorties Status Board (GB'!M36","v":0}]
[{"$f":"'Air Sorties Status Board (AOBD)'!D37","v":0},{"$f":"'Air Sorties Status Board (AOBD)'!E37","v":0},{"$f":"'Air Sorties Status Board (AOBD)'!C37","v":0},{"$f":"'Air Sorties Status Board (AOBD)'!F37","v":0},{"$f":"'Air Sorties Status Board (AOBD)'!O37","v":0},null,{"$f":"'Ground Sorties Status Board (GB'!D37","v":0},{"$f":"'Ground Sorties Status Board (GB'!C37","v":0},{"$f":"'Ground Sorties Status Board (GB'!E37","v":0},{"$f":"'Ground Sorties Status Board (GB'!M37","v":0}]
[{"$f":"'Air Sorties Status Board (AOBD)'!D38","v":0},{"$f":"'Air Sorties Status Board (AOBD)'!E38","v":0},{"$f":"'Air Sorties Status Board (AOBD)'!C38","v":0},{"$f":"'Air Sorties Status Board (AOBD)'!F38","v":0},{"$f":"'Air Sorties Status Board (AOBD)'!O38","v":0},null,{"$f":"'Ground Sorties Status Board (GB'!D38","v":0},{"$f":"'Ground Sorties Status Board (GB'!C38","v":0},{"$f":"'Ground Sorties Status Board (GB'!E38","v":0},{"$f":"'Ground Sorties Status Board (GB'!M38","v":0}]
[{"$f":"'Air Sorties Status Board (AOBD)'!D39","v":0},{"$f":"'Air Sorties Status Board (AOBD)'!E39","v":0},{"$f":"'Air Sorties Status Board (AOBD)'!C39","v":0},{"$f":"'Air Sorties Status Board (AOBD)'!F39","v":0},{"$f":"'Air Sorties Status Board (AOBD)'!O39","v":0},null,{"$f":"'Ground Sorties Status Board (GB'!D39","v":0},{"$f":"'Ground Sorties Status Board (GB'!C39","v":0},{"$f":"'Ground Sorties Status Board (GB'!E39","v":0},{"$f":"'Ground Sorties Status Board (GB'!M39","v":0}]
[{"$f":"'Air Sorties Status Board (AOBD)'!D40","v":0},{"$f":"'Air Sorties Status Board (AOBD)'!E40","v":0},{"$f":"'Air Sorties Status Board (AOBD)'!C40","v":0},{"$f":"'Air Sorties Status Board (AOBD)'!F40","v":0},{"$f":"'Air Sorties Status Board (AOBD)'!O40","v":0},null,{"$f":"'Ground Sorties Status Board (GB'!D40","v":0},{"$f":"'Ground Sorties Status Board (GB'!C40","v":0},{"$f":"'Ground Sorties Status Board (GB'!E40","v":0},{"$f":"'Ground Sorties Status Board (GB'!M40","v":0}]
{"$rows_left_out":11}
{"sheet":"Comm Log","index":6,"n_rows":2,"n_cols":6,"rows_kept":2,"cut":false,"hidden":false,"merged":[[0,1,0,2]]}
[]
["TIME (ZULU)","CHANNEL REF","CALL SIGN","SORTIE","REMARKS","Location or Grid #"]

{"sheet":"Resources (Staging Mngr)","index":7,"n_rows":19,"n_cols":9,"rows_kept":19,"cut":false,"hidden":false,"merged":[[0,0,0,8],[17,0,17,8]]}
[" "]
["CAP ID","TAIL NO","TYPE","BASE LOCATION","AIRPORT ID","STATUS"," Relo CREW","Operational Crew","CAPABILITIES"]
[]
[]
[]
[]
[]
[]
[]
[]
[]
[]
[]
[]
[]
[]
[]
["ALWG Vehicles"]
["CAP ID","GT Call Sign","TYPE","BASE LOCATION","GTL/Driver","STATUS","CREW",null,"CAPABILITIES"]

{"sheet":"SAVE","index":8,"n_rows":1,"n_cols":9,"rows_kept":1,"cut":false,"hidden":true,"merged":[]}
["On Sortie","Completed","Not Completed","Debriefed","Pending","Retasked","Crew Rest/Break","Briefed","Find"]