{"text_format":"1","workbook":"xlsx","n_sheets":5,"sheets":["Summary","OPlan","ExPlan","WMIRS","Metrics"],"not_rendered":{"charts":0,"images":4,"macros":0,"external_links":0,"defined_names":2,"comments":0,"pivot_tables":0},"unopened":[],"bounds":{"document_bytes":16777216,"sheet_cells":100000,"rows_first":2000,"rows_last":500,"rows_between":2000,"halvings":0,"cell_chars":16384,"cell_head_chars":4096},"cells_cut":0,"cells_raw":0,"read":"whole","date_system":"1900"}

{"sheet":"Summary","index":0,"n_rows":4,"n_cols":1,"rows_kept":4,"cut":false,"hidden":false,"merged":[[3,0,43,36],[0,0,0,36],[1,0,2,36]]}
["ALABAMA WING CIVIL AIR PATROL"]
["MISSION SUMMARY"]
[]
["This Page Reserved for Future Use"]

{"sheet":"OPlan","index":1,"n_rows":210,"n_cols":35,"rows_kept":210,"cut":false,"hidden":false,"merged":[[3,23,3,24],[3,17,3,21],[43,21,43,23],[21,20,22,35],[23,2,24,17],[11,10,11,19],[5,25,5,26],[6,25,6,26],[5,33,5,34],[6,33,6,34],[43,25,43,27],[43,29,43,31],[43,33,43,35],[9,19,9,35],[6,7,6,16],[6,20,6,24],[6,4,6,6],[3,8,3,16],[4,8,4,16],[7,4,7,16],[12,10,12,19],[12,5,12,7],[13,5,13,7],[11,8,11,9],[9,4,9,14],[58,3,58,4],[41,13,41,15],[42,13,42,15],[43,13,43,15],[17,10,17,19],[15,10,15,19],[58,18,58,20],[57,18,57,20],[57,14,57,15],[46,0,46,6],[54,5,56,6],[56,16,56,17],[53,3,53,11],[54,12,56,13],[53,12,53,20],[54,14,56,15],[42,5,42,7],[41,9,41,11],[41,17,41,19],[38,17,38,18],[27,20,28,35],[51,18,51,19],[37,27,37,28],[54,16,55,17],[54,18,56,20],[14,25,14,35],[7,25,7,32],[6,28,6,32],[4,20,4,26],[11,5,11,7],[36,27,36,28],[19,20,19,24],[19,25,19,35],[14,8,14,9],[18,25,18,35],[18,20,18,24],[25,2,26,17],[23,20,24,35],[25,20,26,35],[17,20,17,24],[14,5,14,7],[21,2,22,17],[18,10,18,19],[19,10,19,19],[18,8,18,9],[19,8,19,9],[14,10,14,19],[68,25,68,26],[64,27,66,29],[68,9,68,11],[67,27,67,29],[68,16,68,17],[67,5,67,6],[67,7,67,8],[67,12,67,13],[67,21,67,22],[67,23,67,24],[67,25,67,26],[123,0,124,0],[74,12,74,13],[84,14,84,16],[85,14,85,16],[69,21,69,22],[69,23,69,24],[69,25,69,26],[70,12,70,20],[68,18,68,20],[69,12,69,13],[84,6,86,8],[94,3,94,28],[95,3,95,28],[102,2,103,34],[68,12,68,13],[68,27,68,29],[68,14,68,15],[85,11,85,13],[119,1,120,35],[69,18,69,20],[104,2,105,34],[71,18,73,20],[68,3,68,4],[68,23,68,24],[187,3,188,35],[202,18,202,20],[180,3,184,35],[110,2,111,35],[171,4,172,35],[168,4,168,35],[169,4,170,35],[195,1,195,5],[112,2,113,33],[202,0,202,14],[202,15,202,17],[116,0,118,0],[160,3,162,35],[167,3,167,35],[159,3,159,35],[163,3,163,35],[157,3,158,35],[119,0,120,0],[176,3,177,35],[164,3,164,35],[165,3,166,35],[144,0,144,35],[146,2,147,35],[121,0,122,0],[0,0,0,35],[1,0,2,35],[5,28,5,32],[3,34,3,35],[3,28,3,29],[11,20,11,24],[41,21,41,23],[41,25,41,27],[15,20,15,24],[4,28,4,34],[36,12,36,13],[36,17,36,18],[36,22,36,23],[13,10,13,19],[12,25,12,35],[11,25,11,35],[41,29,41,31],[37,12,37,13],[37,22,37,23],[38,22,38,23],[38,27,38,28],[41,5,41,7],[15,5,15,7],[18,5,18,7],[206,15,206,17],[206,18,206,20],[206,21,206,31],[205,32,205,35],[149,3,149,35],[150,3,150,35],[173,3,174,35],[206,32,206,35],[205,0,205,14],[205,15,205,17],[205,18,205,20],[205,21,205,31],[206,0,206,14],[203,18,203,20],[203,21,203,31],[203,32,203,35],[202,21,202,31],[204,21,204,31],[195,9,195,13],[195,16,195,20],[151,4,152,35],[204,18,204,20],[204,0,204,14],[204,15,204,17],[208,0,208,14],[208,15,208,17],[208,18,208,20],[208,21,208,31],[208,32,208,35],[207,0,207,14],[207,15,207,17],[207,18,207,20],[207,21,207,31],[207,32,207,35],[5,20,5,24],[204,32,204,35],[17,25,17,35],[16,5,16,7],[17,5,17,7],[19,5,19,7],[16,8,16,9],[17,8,17,9],[51,10,51,11],[51,26,51,28],[49,26,50,28],[49,18,50,25],[43,5,43,7],[43,9,43,11],[45,0,45,6],[45,7,45,10],[43,2,43,4],[202,32,202,35],[203,0,203,14],[203,15,203,17],[197,1,201,35],[192,0,192,35],[178,3,179,35],[185,3,186,35],[51,8,51,9],[12,20,12,24],[13,20,13,24],[14,20,14,24],[13,25,13,35],[30,1,34,35],[16,10,16,19],[15,8,15,9],[46,7,46,10],[46,24,46,30],[46,19,46,22],[47,19,47,22],[47,24,47,30],[48,0,48,35],[42,9,42,11],[47,0,47,6],[47,31,47,34],[35,33,35,35],[15,25,15,35],[16,20,16,24],[16,25,16,35],[12,8,12,9],[13,8,13,9],[57,25,57,26],[57,16,57,17],[58,14,58,15],[58,16,58,17],[57,21,57,22],[57,23,57,24],[57,9,57,11],[45,12,45,18],[41,33,41,35],[53,21,53,29],[54,21,56,22],[54,23,56,24],[54,25,55,26],[54,27,56,29],[56,25,56,26],[47,7,47,10],[51,4,51,7],[46,12,46,18],[57,27,57,29],[58,21,58,22],[58,23,58,24],[58,25,58,26],[58,27,58,29],[54,7,55,8],[61,18,61,19],[71,14,73,15],[84,3,84,5],[85,3,85,5],[59,16,59,17],[59,18,59,20],[63,21,63,29],[58,9,58,11],[58,12,58,13],[64,25,66,26],[64,5,66,6],[64,7,66,8],[64,14,66,15],[64,16,66,17],[64,18,66,20],[67,14,67,15],[64,23,66,24],[67,18,67,20],[67,16,67,17],[64,21,66,22],[64,9,66,11],[67,9,67,11],[64,12,66,13],[69,16,69,17],[56,7,56,8],[108,2,109,35],[58,5,58,6],[57,5,57,6],[57,12,57,13],[59,5,59,6],[59,12,59,13],[59,9,59,11],[58,7,58,8],[63,3,63,11],[61,26,61,28],[59,21,59,22],[59,23,59,24],[59,25,59,26],[59,27,59,29],[59,0,59,2],[54,3,56,4],[54,9,56,11],[57,3,57,4],[68,21,68,22],[76,18,76,20],[84,9,84,10],[75,18,75,20],[84,11,84,13],[59,7,59,8],[57,7,57,8],[61,8,61,9],[61,10,61,11],[71,16,73,17],[59,14,59,15],[81,14,83,16],[86,14,86,16],[69,0,69,2],[80,3,80,16],[69,14,69,15],[75,14,75,15],[61,4,61,7],[67,3,67,4],[64,3,66,4],[59,3,59,4],[63,12,63,20],[141,0,142,0],[125,0,126,0],[137,0,138,0],[133,0,134,0],[135,0,136,0],[129,0,130,0],[131,0,132,0],[139,0,140,0],[127,0,128,0],[139,1,140,35],[75,16,75,17],[79,14,79,17],[85,9,85,10],[76,14,76,15],[76,12,76,13],[74,18,74,20],[106,2,107,35],[96,0,96,35],[86,3,86,5],[89,3,89,28],[90,3,90,28],[86,0,86,2],[88,3,88,28],[86,9,86,10],[98,2,99,35],[93,29,93,32],[93,3,93,28],[95,29,95,33],[86,11,86,13],[90,29,90,33],[88,29,88,32],[89,29,89,33],[94,29,94,33],[210,1,216,35],[217,1,222,35],[39,12,39,13],[39,17,39,18],[39,22,39,23],[39,27,39,28],[125,1,126,35],[47,12,47,18],[69,9,69,11],[68,5,68,6],[68,7,68,8],[69,5,69,6],[69,7,69,8],[69,3,69,4],[141,1,142,35],[123,1,124,35],[137,1,138,35],[133,1,134,35],[127,1,128,35],[129,1,130,35],[131,1,132,35],[153,4,154,35],[75,12,75,13],[92,14,92,17],[229,1,234,35],[37,17,37,18],[27,2,28,17],[38,12,38,13],[42,16,43,20],[74,14,74,15],[74,16,74,17],[71,12,73,13],[100,2,101,35],[46,31,46,34],[45,19,45,22],[223,1,228,35],[135,1,136,35],[42,2,42,4],[42,33,42,35],[42,25,42,27],[42,29,42,31],[42,21,42,23],[121,1,122,35],[81,9,83,10],[81,3,83,5],[81,6,83,8],[81,11,83,13],[69,27,69,29]]}
["AL WING CIVIL AIR PATROL"]
["OPERATIONS PLAN AS13"]
[]
["1. MISSION:",null,null,null,"A. Number",null,null,null,{"$f":"IF(ExPlan!$I$5=0,\" \",+ExPlan!I5)","v":" "},null,null,null,null,null,null,null,null,"C. Complexity:",null,null,null,null,null,"Crawl",null,null,null,null,"Walk",null,null,null,null,null,"Run"]
[null,null,null,null,"B. Symbol",null,null,null,null,null,null,null,null,null,null,null,null,"2. DATES",null,null,"A. Primary",null,null,null,null,null,null,null,"B. Alternate"]
["3. HOST UNIT",null,null,null,null,null,null,null,null,null,null,null,null,null,null,null,null,null,"Start",null,null,null,null,null,null,{"$f":"IF(U6=0,\"\",1+U7-U6)","v":""},null,null,null,null,null,null,null,{"$f":"IF(AC6=0,\"\",1+AC7-AC6)","v":""}]
[null,"Charter #:",null,null,"SER-AL-",null,null,"001",null,null,null,null,null,null,null,null,null,null,"End",null,null,null,null,null,null,"days",null,null,null,null,null,null,null,"days"]
[null,"Name:",null,null,"Alabama Wing",null,null,null,null,null,null,null,null,null,null,null,null,null,"Registration Deadline:",null,null,null,null,null,null,"2013-05-16"]
["4. INCIDENT COMMAND POST"]
["A.","Facility",null,null,null,null,null,null,null,null,null,null,null,null,null,"B. Address"]
["5. KEY PERSONNEL (Positions in italics are the minimum required for OPlan submission)"]
[null,null,null,null,null,"CAPID",null,null,"Grade",null,"Name",null,null,null,null,null,null,null,null,null,"Telephone",null,null,null,null,"E-mail"]
["A. Host CC"]
["B. Project Officer:"]
["C. Incident Cdr:"]
["D. Safety Officer"]
["E. OSC: "]
["F. PSC:"]
["G. LSC"]
["H. CUL"]
["6. KEY TRAINING OBJECTIVES (Continue in block 11, if necessary)"]
[null,"A."]
[]
[null,"B."]
[]
[null,"C."]
[]
[null,"D."]
[]
["7. MISSION SCENARIO (continue in block 11, if necessary)"]
[]
[]
[]
[]
[]
["8. PLANNING DATA",null,null,null,null,null,null,null,null,null,null,null,null,null,null,null,null,null,null,null,null,null,null,null,null,null,null,null,"Time Zone Used:",null,null,null,null,"CDT"]
["A. Maximum Number of Personnel:",null,null,null,null,null,null,null,null,null,"SM:",null,null,null,null,"Cadet:",null,null,null,null,"Other:",null,null,null,null,"Tot.",null,{"$f":"IF(M37+R37+W37=0,\" \",+W37+R37+M37)","v":" "}]
[null,"Optimum Number of Personnel:",null,null,null,null,null,null,null,null,"SM:",null,null,null,null,"Cadet:",null,null,null,null,"Other:",null,null,null,null,"Tot.",null,{"$f":"IF(M38+R38+W38=0,\" \",+W38+R38+M38)","v":" "}]
[null,"Minimum Number of Personnel:",null,null,null,null,null,null,null,null,"SM:",null,null,null,null,"Cadet:",null,null,null,null,"Other:",null,null,null,null,"Tot.",null,{"$f":"IF(M39+R39+W39=0,\" \",+W39+R39+M39)","v":" "}]
[null,"*Expected Number of Personnel:",null,null,null,null,null,null,null,null,"SM:",null,null,null,null,"Cadet:",null,null,null,null,"Other:",null,null,null,null,"Tot.",null,{"$f":"IF(M40+R40+W40=0,\" \",+W40+R40+M40)","v":" "},null,null,"*Required"]
["B.","Weather/Light Data"]
[null,null,null,null,null,"Sunrise",null,null,null,"Sunset",null,null,null,"% Illum.",null,null,null,null,null,null,null,"Avg Low",null,null,null,"Avg High",null,null,null,"Rec. Low",null,null,null,"Rec. High"]
["Start",null,{"$f":"IF(U6=0,\" \",+U6)","v":" "},null,null,null,null,null,null,null,null,null,null,null,null,null,"Temperatures"]
["End",null,{"$f":"IF(U7=0,\" \",+U7)","v":" "}]
["C. Additional Operational Locations: (Continue in block 11, if necessary)"]
["Location",null,null,null,null,null,null,"Purpose",null,null,null,null,"Location",null,null,null,null,null,null,"Purpose",null,null,null,null,"Location",null,null,null,null,null,null,"Purpose"]
[]
[]
["OPERATIONS PLAN (Page 2)"]
["9. SORTIE AND COST SUMMARY",null,null,null,null,null,null,null,null,null,null,null,null,null,null,null,null,null,"Projected OPlan Cost:",null,null,null,null,null,null,null,{"$f":"+AA52+AA62+O80+O93","v":0}]
[]
[null,"A. Air",null,null,"Fuel Price:",null,null,null,null,null,"/gal",null,null,null,"Total Hours:",null,null,null,{"$f":"IF(F60+O60+X60=0,\" \",+F60+O60+X60)","v":" "},null,null,null,"Total Cost:",null,null,null,{"$f":"+J60+S60+AB60","v":0}]
[]
[null,null,null,"C-172",null,null,null,null,null,null,null,null,"C-182",null,null,null,null,null,null,null,null,"Other"]
[null,null,null,"# of Sorties",null,"Total Hours",null,"Fuel Burn",null,"Total",null,null,"# of Sorties",null,"Total Hours",null,"Fuel Burn",null,"Total",null,null,"# of Sorties",null,"Total Hours",null,"Fuel Burn",null,"Total"]
[]
[null,null,null,null,null,null,null,"Gal/Hr",null,null,null,null,null,null,null,null,"Gal/Hr",null,null,null,null,null,null,null,null,"Gal/Hr"]
["1. Ferry",null,null,null,null,null,null,9,null,{"$f":"+F58*H58*$I$52","v":0},null,null,null,null,null,null,13,null,{"$f":"+O58*Q58*$I$52","v":0},null,null,null,null,null,null,null,null,{"$f":"+X58*Z58*$I$52","v":0}]
["2. Mission",null,null,null,null,null,null,9,null,{"$f":"+F59*H59*$I$52","v":0},null,null,null,null,null,null,13,null,{"$f":"+O59*Q59*$I$52","v":0},null,null,null,null,null,null,null,null,{"$f":"+X59*Z59*$I$52","v":0}]
["3. Totals",null,null,{"$f":"SUM(D58:E59)","v":0},null,{"$f":"SUM(F58:G59)","v":0},null,null,null,{"$f":"J58+J59","v":0},null,null,{"$f":"SUM(M58:N59)","v":0},null,{"$f":"SUM(O58:P59)","v":0},null,null,null,{"$f":"S58+S59","v":0},null,null,{"$f":"IF(V58+V59=0,\" \",+SUM(V58:W59))","v":" "},null,{"$f":"SUM(X58:Y59)","v":0},null,null,null,{"$f":"AB58+AB59","v":0}]
[]
[null,"B.Ground",null,null,"Fuel Price:",null,null,null,3.25,null,"/gal",null,null,null,"Total Miles:",null,null,null,{"$f":"+F70+O70+X70+O77","v":0},null,null,null,"Total Cost:",null,null,null,{"$f":"+J70+S70+AB70+S77","v":0}]
[]
[null,null,null,"Vans",null,null,null,null,null,null,null,null,"Pickup",null,null,null,null,null,null,null,null,"Other COV"]
[null,null,null,"# of Sorties",null,"Total Miles",null,"MPG",null,"Total",null,null,"# of Sorties",null,"Total Miles",null,"MPG",null,"Total",null,null,"# of Sorties",null,"Total Miles",null,"MPG",null,"Total"]
[]
[]
["1. Ferry",null,null,null,null,null,null,10,null,{"$f":"+(F68/H68)*$I$62","v":0},null,null,null,null,null,null,12,null,{"$f":"+(O68/Q68)*$I$62","v":0},null,null,null,null,null,null,null,null,{"$f":"IF(Z68=0,\" \",+(X68/Z68)*$I$62)","v":" "}]
["2. Mission",null,null,null,null,null,null,10,null,{"$f":"+(F69/H69)*$I$62","v":0},null,null,null,null,null,null,12,null,{"$f":"+(O69/Q69)*$I$62","v":0},null,null,null,null,null,null,null,null,{"$f":"IF(Z69=0,\" \",+(X69/Z69)*$I$62)","v":" "}]
["3. Totals",null,null,{"$f":"SUM(D68:E69)","v":0},null,{"$f":"SUM(F68:G69)","v":0},null,null,null,{"$f":"SUM(J68:K69)","v":0},null,null,{"$f":"SUM(M68:N69)","v":0},null,{"$f":"SUM(O68:P69)","v":0},null,null,null,{"$f":"SUM(S68:T69)","v":0},null,null,{"$f":"SUM(V68:W69)","v":0},null,{"$f":"SUM(X68:Y69)","v":0},null,null,null,{"$f":"SUM(AB68:AC69)","v":0}]
[null,null,null,null,null,null,null,null,null,null,null,null,"POV [see block 12(C)7]"]
[null,null,null,null,null,null,null,null,null,null,null,null,"# of Sorties",null,"Total Miles",null,"MPG",null,"Total"]
[]
[]
[null,null,null,null,null,null,null,null,null,"1. Ferry",null,null,null,null,null,null,null,null,{"$f":"IF(Q75=0,\" \",+(O75/Q75)*$I$62)","v":" "}]
[null,null,null,null,null,null,null,null,null,"2. Mission",null,null,null,null,null,null,null,null,{"$f":"IF(Q76=0,\" \",+(O76/Q76)*$I$62)","v":" "}]
[null,null,null,null,null,null,null,null,null,"3. Totals",null,null,{"$f":"SUM(M75:N76)","v":0},null,{"$f":"SUM(O75:P76)","v":0},null,null,null,{"$f":"SUM(S75:T76)","v":0}]
[]
[]
[null,"C. Communications (Specify)",null,null,null,null,null,null,null,null,null,null,"Total:",null,{"$f":"+O87+AD90+AD91+O93","v":0}]
[null,null,null,"Trailer"]
[null,null,null,"Utilization (Days)",null,null,"$/day",null,null,"Tot. Oper. Hours",null,"$/hr",null,null,"Total"]
[]
[]
["1. Ferry",null,null,null,null,null,null,null,null,null,null,null,null,null,0]
["2. Mission",null,null,1,null,null,null,null,null,null,null,null,null,null,0]
["3. Totals",null,null,{"$f":"SUM(D85:F86)","v":1},null,null,null,null,null,null,null,null,null,null,{"$f":"SUM(O85:Q86)","v":0}]
[]
[null,null,null,"Expense",null,null,null,null,null,null,null,null,null,null,null,null,null,null,null,null,null,null,null,null,null,null,null,null,null,"Total Cost"]
[null,null,"4.","Aircard Internet access 3 days @ 15/day ",null,null,null,null,null,null,null,null,null,null,null,null,null,null,null,null,null,null,null,null,null,null,null,null,null,0]
[null,null,"5.","Satellite Internet access (See section 11)",null,null,null,null,null,null,null,null,null,null,null,null,null,null,null,null,null,null,null,null,null,null,null,null,null,0]
[]
[null,"D. Other (Specify and Justify)",null,null,null,null,null,null,null,null,null,null,"Total:",null,{"$f":"+AD95+AD96","v":0}]
[null,null,null,"Expense",null,null,null,null,null,null,null,null,null,null,null,null,null,null,null,null,null,null,null,null,null,null,null,null,null,"Total Cost"]
[null,null,1]
[null,null,"2."]
["OPERATIONS PLAN (Page 3)"]
["10. SAFETY CONSIDERATIONS (in sentence form)"]
[null,"A.","The Mission Safety Officer will conduct an ORM review to consider weather factors, facilities, remote operating locations, vehicle and flightline operations. This review will be summarized in a safety briefing prior to startex."]
[]
[null,"B.","Crew experience with expected weather conditions will be considered when assembling crews and/or ground teams.  ALCON should be mindful of spring weather conditions and potential for spring storms and have contingency plan."]
[]
[null,"C.","Ground Team leaders will stress safety during dismounted operations in proximity to roadways, parking areas, and within the target area. All members will wear reflective vests when dismounted from vehicles. "]
[]
[null,"D.","Ground team members will use caution when operating on rural roadways with narrow shoulders to avoid traffic."]
[]
[null,"E.","If a CAP flight line is used, qualified flightline supervisors will be present.  Supervisors and trainees shall consider the traffic density and activity in ramp area to avoid positioning trainees in hazardous positions."]
[]
[null,"F.","To address the potential for fire when starting aircraft, a fire extinguisher(s) shall be present on the flight line during operations."]
[]
[null,"G.","MSO will provide a safety briefing to IC and Operations prior to any vehicle release. IC and/or Operations will brief driver before release is given. Briefing will include any adverse WX and road conditions to avoid. "]
[]
[null,"H.","All flights will be IAW restrictions in 60-1"]
[]
[]
["11. CONTINUATION:"]
["Block"]
[]
[]
[7]
[]
["**"]
[]
[null,"BLANK"]
[]
[null,"BLANK"]
[]
[null,"BLANK"]
[]
[null,"BLANK"]
[]
[null,"BLANK"]
[]
[null,"BLANK"]
[]
[null,"BLANK"]
[]
[null,"BLANK"]
[]
[null,"BLANK"]
[]
[null,"BLANK"]
[]
[]
["OPERATIONS PLAN (Page 4)"]
["12. GENERAL REQUIREMENTS"]
[null,"A. ","The project officer is responsible to notify key mission personnel, of any changes to the mission schedule."]
[]
[null,"B. Air Operations"]
[null,null,"1.","Member-owned aircraft may only be used on this mission with prior approval of the wing commander IAW CAPR ****."]
[null,null,"2.","Ferry Sorties"]
[null,null,null,"a.","Inbound and outbound Air Sorties are considered a part of this exercise and must be entered into WMIRS NLT the day before the anticipated movement. "]
[]
[null,null,null,"b.","Members will complete ICS 211, ICS 218, and CAPF 104; complete an ORM assessment; and receive a safety briefing prior to departing home base and will ensure all completed forms are provided to the AOBD/IC upon arrival."]
[]
[]
[null,"C. Ground Operations"]
[null,null,"1.","Inbound/outbound ground transportation is considered a part of this exercise and will be released by the exercise IC or his/her designee"]
[]
[null,null,"2.","Documentation of the inbound and outbound movements (CAPF 109) must be included in the mission documentation.  "]
[null,null,"3.","The vehicle operator will complete the pre-mission sign-in of resources (ICS 218) and personnel (ICS 211); complete an ORM assessment; and receive a safety briefing prior to departing “home base” and provide the all completed forms to the mission staff upon arrival at the exercise site."]
[]
[]
[null,null,"4.","Corporate owned Vehicles (COVs) will be utilized to the greatest extent possible. "]
[null,null,"5.","All vehicles will be inspected using a CAPF 73 prior to being sortied. "]
[null,null,"6.","The mission use will be documented on the CAPF109, and all documents as well as fuel receipts will be included in the post-mission submission."]
[]
[null,null,7,"Privately Owned Vehicle (POV) Usage"]
[null,null,null,"a.","The use of POVs as part of this mission will be in full compliance with CAPR 77-1, para 7b."]
[null,null,null,"b.","POVs will be signed in to the exercise prior to use (see para. 10C(3) above) and all use will be planned, briefed, and debriefed as part of the mission."]
[]
[null,null,null,"c.","POVs (for reimbursement and liability purposes) will not be used to transport members to/from their homes as part of this training mission."]
[]
[null,null,"8.","Locations within ALWG are considered part of this exercise for use as target locations."]
[]
[null,"D. Safety"]
[null,null,"1.","A qualified Mission Safety Officer (MSO) must coordinate with the IC and complete an ORM review and safety inspection prior to mission start."]
[]
[null,null,"2.","Written documentation of the ORM review will be kept with the IC/POC at the mission base, and will be included with the post-mission package."]
[]
[null,null,"3.","A qualified Mission Safety Officer (MSO) must be at the mission base during the initial portion of all training exercises. Once the ORM review, mission brief, and safety inspections are complete, the MSO may, at the discretion of the IC, leave the mission base. However, the MSO must remain readily contactable during the entire mission. The MSO assigned will conduct an ORM-based review of the exercise prior to the first event starting from the mission base. Written documentation of the review will be kept with the IC/POC at the mission base, and will be included with the post-mission paperwork package."]
[]
[]
[]
[]
[null,null,"4.","In the event of a recordable mishap (see CAPR62-2), the IC will ensure all reporting actions are taken IAW CAP and AL Wing guidelines "]
[]
[null,null,"5.","The IC will make the determination if the exercise should be modified or suspended based on the circumstances surrounding the mishap."]
[]
[]
[]
[]
["OPERATIONS PLAN (Page 5)"]
["13. SUBMISSION TIMELINE"]
[]
[]
["14. CERTIFICATION"]
[null,"I certify the mission described above has been fully planned as described above. All CAP activities will be done IAW CAP regulations. I certify the accuracy of this entire OPlan as a condition for submitting it into WMIRS for Air Force approval. Request(s) for reimbursement, and signature/electronic approval of the CAPF108 (or equivalent electronic form) by the AL Wing/CC and/or his/her documented designee under the authorization for this mission will only be for those activities and resources specifically described above."]
[]
[]
[]
[]
["Name",null,null,null,null,null,null,null,null,null,null,null,null,null,null,"Grade",null,null,"Position",null,null,"Signature",null,null,null,null,null,null,null,null,null,null,"Date"]
[null,null,null,null,null,null,null,null,null,null,null,null,null,null,null,null,null,null,"IC"]
[null,null,null,null,null,null,null,null,null,null,null,null,null,null,null,null,null,null,"MSO"]
[null,null,null,null,null,null,null,null,null,null,null,null,null,null,null,null,null,null,"PSC"]
[null,null,null,null,null,null,null,null,null,null,null,null,null,null,null,null,null,null,"Host CC"]
[null,null,null,null,null,null,null,null,null,null,null,null,null,null,null,null,null,null,"Proj Offc"]
[null,null,null,null,null,null,null,null,null,null,null,null,null,null,null,null,null,null,"Wing CC"]
["15. REVIEWERS' COMMENTS"]

{"sheet":"ExPlan","index":2,"n_rows":43,"n_cols":35,"rows_kept":43,"cut":false,"hidden":false,"merged":[[43,1,43,34],[34,18,34,34],[35,18,35,34],[36,18,36,34],[37,18,37,34],[42,1,42,34],[36,1,36,17],[34,1,34,17],[39,1,39,34],[37,1,37,17],[35,1,35,17],[40,1,40,34],[31,18,31,34],[15,2,15,4],[24,21,24,30],[17,31,17,34],[17,21,17,30],[21,17,21,20],[16,13,16,16],[17,9,17,12],[17,13,17,16],[24,13,24,16],[15,31,15,34],[15,5,15,8],[15,21,15,30],[26,1,26,17],[23,21,23,30],[24,31,24,34],[22,17,22,20],[22,21,22,30],[22,31,22,34],[23,31,23,34],[24,17,24,20],[23,9,23,12],[23,13,23,16],[16,17,16,20],[14,2,14,4],[14,5,14,8],[13,31,13,34],[14,31,14,34],[33,1,33,17],[29,18,29,34],[30,1,30,17],[29,1,29,17],[32,18,32,34],[33,18,33,34],[30,18,30,34],[28,18,28,34],[27,1,27,17],[28,1,28,17],[27,18,27,34],[32,1,32,17],[31,1,31,17],[15,9,15,12],[20,21,20,30],[23,17,23,20],[20,13,20,16],[20,17,20,20],[24,2,24,4],[26,18,26,34],[14,9,14,12],[7,25,8,26],[3,14,3,20],[16,2,16,4],[16,5,16,8],[5,8,5,16],[5,20,5,26],[14,13,14,16],[13,5,13,8],[8,4,8,16],[15,13,15,16],[15,17,15,20],[14,21,14,30],[8,28,8,32],[10,19,10,35],[7,28,7,32],[13,9,13,12],[13,2,13,4],[14,17,14,20],[13,13,13,16],[13,21,13,30],[10,4,10,14],[8,20,8,24],[13,17,13,20],[0,0,0,36],[1,0,2,36],[6,25,6,26],[5,28,5,34],[7,4,7,6],[4,28,4,29],[7,33,8,34],[4,17,4,21],[7,20,7,24],[4,23,4,24],[4,34,4,36],[7,7,7,16],[4,8,4,15],[16,21,16,30],[21,31,21,34],[21,21,21,30],[16,31,16,34],[20,31,20,34],[17,17,17,20],[23,2,23,4],[21,13,21,16],[24,5,24,8],[24,9,24,12],[21,2,21,4],[16,9,16,12],[21,5,21,8],[21,9,21,12],[20,9,20,12],[23,5,23,8],[17,5,17,8],[17,2,17,4],[20,2,20,4],[20,5,20,8],[22,2,22,4],[22,5,22,8],[22,9,22,12],[22,13,22,16]]}
["AL WING CIVIL AIR PATROL"]
["EXECUTION  PLAN"]
[]
[]
["1. MISSION:",null,null,null,"A. Number",null,null,null,null,null,null,null,null,null,null,null,null,"C. Complexity:",null,null,null,null,null,"Crawl",null,null,null,null,"Walk",null,null,null,null,"x","Run"]
[null,null,null,null,"B. Symbol",null,null,null,{"$f":"+OPlan!I5","v":0},null,null,null,null,null,null,null,null,"2. DATES",null,null,"A. Primary",null,null,null,null,null,null,null,"B. Secondary"]
["3. HOST UNIT",null,null,null,null,null,null,null,null,null,null,null,null,null,null,null,null,null,null,null,null,null,null,null,null,"Dur.",null,null,null,null,null,null,null,"Dur."]
[null,"Charter #:",null,null,"SER-AL-",null,null,{"$f":"+OPlan!H7","v":"001"},null,null,null,null,null,null,null,null,null,null,"Start",null,{"$f":"+OPlan!U6","v":"00:00:00"},null,null,null,null,{"$f":"+U9-U8+1","v":1}]
[null,"Name:",null,null,{"$f":"+OPlan!E8","v":"Alabama Wing"},null,null,null,null,null,null,null,null,null,null,null,null,null,"End",null,{"$f":"+OPlan!U7","v":"00:00:00"}]
["4. INCIDENT COMMAND POST"]
["A.","Facility",null,null,{"$f":"+OPlan!E10","v":0},null,null,null,null,null,null,null,null,null,null,"B. Address",null,null,null,{"$f":"+OPlan!T10","v":0}]
["5. FERRY INFORMATION (include both movements to and from the exercise location) "]
["A. Air"]
[null,null,"Type",null,null,"Origin",null,null,null,"Depart DTG",null,null,null,"Destination",null,null,null,"Arrival DTG",null,null,null,"PIC",null,null,null,null,null,null,null,null,null,"Msn Symbol"]
[null,"1"]
[null,"2."]
[null,"3."]
[null,"4."]
[]
["B. Ground"]
[null,null,"Type",null,null,"Origin",null,null,null,"Depart DTG",null,null,null,"Destination",null,null,null,"Arrival DTG",null,null,null,"Driver",null,null,null,null,null,null,null,null,null,"Msn Symbol"]
[null,"1"]
[null,"2."]
[null,"3."]
[null,"4."]
["6. TARGET LOCATIONS"]
[]
[]
[]
[]
[]
[]
[]
[]
[]
[]
[]
[]
["7. MEAL PLAN"]
[null,"Meals will be provided by members"]
[]
["8. BILLETING PLAN"]
[null,"Billeting is not provided"]

{"sheet":"WMIRS","index":3,"n_rows":132,"n_cols":32,"rows_kept":132,"cut":false,"hidden":false,"merged":[[0,0,0,35],[1,0,2,35],[3,7,3,9],[16,10,16,19],[16,20,16,24],[5,4,5,10],[64,4,64,5],[64,6,64,7],[64,15,64,16],[64,13,64,14],[61,28,63,30],[61,24,63,25],[61,8,62,9],[64,8,64,9],[64,10,64,12],[61,15,63,16],[63,26,63,27],[61,10,63,12],[61,13,63,14],[28,20,29,35],[7,17,7,21],[6,11,7,13],[6,24,7,26],[6,4,6,8],[6,9,7,10],[63,8,63,9],[63,17,63,18],[64,17,64,18],[64,19,64,21],[11,0,11,6],[12,12,12,18],[58,10,58,11],[61,6,63,7],[11,12,11,18],[28,2,29,17],[13,7,13,10],[13,12,13,18],[20,3,20,4],[58,18,58,19],[52,2,53,35],[26,2,27,17],[12,31,12,34],[13,31,13,34],[11,19,11,22],[18,20,18,24],[22,2,23,17],[24,2,25,17],[22,20,23,35],[5,17,5,23],[9,19,9,35],[60,22,60,30],[61,26,62,27],[17,25,17,35],[13,19,13,22],[56,26,57,28],[44,2,45,35],[46,2,47,35],[58,26,58,28],[56,18,57,25],[61,17,62,18],[61,19,63,21],[6,17,6,21],[6,22,7,23],[7,4,7,8],[11,7,11,10],[15,25,15,35],[16,25,16,35],[9,4,9,14],[15,8,15,9],[15,10,15,19],[60,4,60,12],[60,13,60,21],[24,20,25,35],[12,7,12,10],[15,5,15,7],[12,0,12,6],[13,0,13,6],[66,22,66,23],[66,17,66,18],[66,19,66,21],[65,24,65,25],[18,8,18,9],[20,8,20,9],[50,2,51,35],[31,1,36,35],[38,2,39,35],[65,4,65,5],[65,6,65,7],[65,8,65,9],[65,19,65,21],[65,22,65,23],[65,17,65,18],[65,26,65,27],[65,15,65,16],[64,24,64,25],[66,15,66,16],[66,4,66,5],[66,6,66,7],[66,8,66,9],[66,10,66,12],[61,22,63,23],[125,0,126,0],[125,1,126,35],[119,0,120,0],[119,1,120,35],[121,0,122,0],[121,1,122,35],[123,0,124,0],[74,28,74,30],[111,0,112,0],[75,28,75,30],[76,28,76,30],[74,24,74,25],[100,29,100,32],[96,29,96,33],[95,29,95,32],[74,26,74,27],[75,22,75,23],[93,11,93,13],[75,24,75,25],[131,0,132,0],[131,1,132,35],[127,0,128,0],[127,1,128,35],[129,0,130,0],[129,1,130,35],[123,1,124,35],[113,1,114,35],[115,0,116,0],[115,1,116,35],[117,0,118,0],[117,1,118,35],[113,0,114,0],[75,26,75,27],[76,17,76,18],[76,24,76,25],[92,11,92,13],[91,14,91,16],[91,11,91,13],[111,1,112,35],[76,0,76,2],[86,14,86,17],[87,3,87,16],[88,3,90,5],[93,3,93,5],[93,0,93,2],[93,9,93,10],[97,29,97,33],[76,26,76,27],[88,6,90,8],[88,9,90,10],[88,11,90,13],[88,14,90,16],[76,6,76,7],[76,8,76,9],[76,22,76,23],[76,10,76,12],[81,19,81,21],[81,13,81,14],[78,19,80,21],[81,15,81,16],[81,17,81,18],[101,29,101,33],[109,0,110,0],[109,1,110,35],[104,0,104,35],[102,29,102,33],[95,3,95,28],[97,3,97,28],[101,3,101,28],[100,3,100,28],[99,14,99,17],[106,0,108,0],[91,3,91,5],[92,3,92,5],[91,6,93,8],[91,9,91,10],[92,9,92,10],[102,3,102,28],[93,14,93,16],[96,3,96,28],[92,14,92,16],[68,4,68,7],[68,8,68,9],[68,10,68,11],[74,4,74,5],[71,10,73,12],[71,13,73,14],[71,15,73,16],[74,22,74,23],[74,15,74,16],[74,17,74,18],[74,19,74,21],[74,13,74,14],[74,6,74,7],[74,8,74,9],[74,10,74,12],[82,13,82,14],[82,15,82,16],[82,17,82,18],[82,19,82,21],[83,15,83,16],[83,19,83,21],[83,13,83,14],[76,4,76,5],[12,24,12,30],[13,24,13,30],[65,10,65,12],[65,13,65,14],[18,5,18,7],[20,13,20,14],[42,2,43,35],[58,4,58,7],[58,8,58,9],[55,0,55,35],[17,20,17,24],[16,5,16,7],[16,8,16,9],[17,5,17,7],[17,8,17,9],[17,10,17,19],[20,18,20,19],[65,28,65,30],[12,19,12,22],[15,20,15,24],[61,4,63,5],[64,26,64,27],[64,28,64,30],[64,22,64,23],[66,0,66,2],[40,2,41,35],[48,2,49,35],[26,20,27,35],[18,25,18,35],[18,10,18,19],[71,22,73,23],[71,24,73,25],[70,22,70,30],[68,18,68,19],[71,26,73,27],[71,28,73,30],[71,19,73,21],[70,13,70,21],[66,26,66,27],[66,28,66,30],[68,26,68,28],[66,13,66,14],[71,4,73,5],[66,24,66,25],[70,4,70,12],[71,6,73,7],[71,8,73,9],[71,17,73,18],[75,4,75,5],[76,15,76,16],[76,19,76,21],[77,13,77,21],[78,13,80,14],[78,15,80,16],[78,17,80,18],[75,17,75,18],[75,6,75,7],[75,8,75,9],[75,10,75,12],[75,13,75,14],[75,15,75,16],[75,19,75,21],[76,13,76,14]]}
["AL WING CIVIL AIR PATROL"]
["WMIRS SUBMISSION"]
[]
["1. MISSION SYMBOL:",null,null,null,null,null,null,{"$f":"+OPlan!I5","v":0}]
["2. PROPOSED DATES"]
[null,null,null,null,"A. Primary",null,null,null,null,null,null,null,null,null,null,null,null,"B. Alternate"]
[null,null,"Start",null,{"$f":"IF(OPlan!U6=0,\" \",+OPlan!U6)","v":" "},null,null,null,null,{"$f":"IF(E7=0,\" \",+E8-E7+1)","v":{"$error":"#VALUE!"}},null,"day(s)",null,null,null,null,null,{"$f":"IF(OPlan!AC6=0,\" \",+OPlan!AC6)","v":" "},null,null,null,null,{"$f":"+R8-R7+1","v":{"$error":"#VALUE!"}},null,"day(s)"]
[null,null,"End",null,{"$f":"IF(OPlan!U7=0,\" \",+OPlan!U7)","v":" "},null,null,null,null,null,null,null,null,null,null,null,null,{"$f":"IF(OPlan!AC7=0,\" \",+OPlan!AC7)","v":" "}]
["3. INCIDENT COMMAND POST"]
["A.","Facility",null,null,{"$f":"+OPlan!E10","v":0},null,null,null,null,null,null,null,null,null,null,"B. Address",null,null,null,{"$f":"+OPlan!T10","v":0}]
["C. Additional Operational Locations:"]
["Location",null,null,null,null,null,null,"Purpose",null,null,null,null,"Location",null,null,null,null,null,null,"Purpose",null,null,null,null,"Location",null,null,null,null,null,null,"Purpose"]
[{"$f":"+OPlan!A47","v":0},null,null,null,null,null,null,{"$f":"+OPlan!H47","v":0},null,null,null,null,{"$f":"+OPlan!M47","v":0},null,null,null,null,null,null,{"$f":"+OPlan!T47","v":0},null,null,null,null,{"$f":"+OPlan!Y47","v":0},null,null,null,null,null,null,{"$f":"+OPlan!AF47","v":0}]
[{"$f":"+OPlan!A48","v":0},null,null,null,null,null,null,{"$f":"+OPlan!H48","v":0},null,null,null,null,{"$f":"+OPlan!M48","v":0},null,null,null,null,null,null,{"$f":"+OPlan!T48","v":0},null,null,null,null,{"$f":"+OPlan!Y48","v":0},null,null,null,null,null,null,{"$f":"+OPlan!AF48","v":0}]
["4. KEY PERSONNEL"]
[null,null,null,null,null,"CAPID",null,"Grade","Grade",null,"Name",null,null,null,null,null,null,null,null,null,"Telephone",null,null,null,null,"E-mail"]
["A. Project Officer:",null,null,null,null,{"$f":"+OPlan!F14","v":0},null,{"$f":"+OPlan!H14","v":0},{"$f":"+OPlan!I14","v":0},null,{"$f":"+OPlan!K14","v":0},null,null,null,null,null,null,null,null,null,{"$f":"+OPlan!U14","v":0},null,null,null,null,{"$f":"+OPlan!Z14","v":0}]
["B. Incident Cdr:",null,null,null,null,{"$f":"+OPlan!F15","v":0},null,{"$f":"+OPlan!H15","v":0},{"$f":"+OPlan!I15","v":0},null,{"$f":"+OPlan!K15","v":0},null,null,null,null,null,null,null,null,null,{"$f":"+OPlan!U15","v":0},null,null,null,null,{"$f":"+OPlan!Z15","v":0}]
["C. Safety Officer",null,null,null,null,{"$f":"+OPlan!F16","v":0},null,{"$f":"+OPlan!H16","v":0},{"$f":"+OPlan!I16","v":0},null,{"$f":"+OPlan!K16","v":0},null,null,null,null,null,null,null,null,null,{"$f":"+OPlan!U16","v":0},null,null,null,null,{"$f":"+OPlan!Z16","v":0}]
["5. EXPECTED PERSONNEL"]
[null,"SM:",null,{"$f":"+OPlan!M40","v":0},null,null,"Cadet:",null,{"$f":"+OPlan!R40","v":0},null,null,"Other:",null,{"$f":"+OPlan!W40","v":0},null,null,"Tot.",null,{"$f":"+OPlan!AB40","v":" "}]
["6. KEY TRAINING OBJECTIVES (continue in block 10, if necessary)"]
[null,"A.",{"$f":"IF(OPlan!C22=0,\"Not Used\",+OPlan!C22)","v":"Not Used"},null,null,null,null,null,null,null,null,null,null,null,null,null,null,null,null,"E.",{"$f":"IF(OPlan!U22=0,\"Not Used\",+OPlan!U22)","v":"Not Used"}]
[]
[null,"B.",{"$f":"IF(OPlan!C24=0,\"Not Used\",+OPlan!C24)","v":"Not Used"},null,null,null,null,null,null,null,null,null,null,null,null,null,null,null,null,"F.",{"$f":"IF(OPlan!U24=0,\"Not Used\",+OPlan!U24)","v":"Not Used"}]
[]
[null,"C.",{"$f":"IF(OPlan!C26=0,\"Not Used\",+OPlan!C26)","v":"Not Used"},null,null,null,null,null,null,null,null,null,null,null,null,null,null,null,null,"G.",{"$f":"IF(OPlan!U26=0,\"Not Used\",+OPlan!U26)","v":"Not Used"}]
[]
[null,"D.",{"$f":"IF(OPlan!C28=0,\"Not Used\",+OPlan!C28)","v":"Not Used"},null,null,null,null,null,null,null,null,null,null,null,null,null,null,null,null,"H.",{"$f":"IF(OPlan!U28=0,\"Not Used\",+OPlan!U28)","v":"Not Used"}]
[]
["7. MISSION SCENARIO (continue in block 10, if necessary)"]
[null,{"$f":"+OPlan!B31","v":0}]
[]
[]
[]
[]
[]
["8. SAFETY CONSIDERATIONS (in sentence form)"]
[null,"A.",{"$f":"IF(OPlan!C99=0,\"Not Used\",+OPlan!C99)","v":"The Mission Safety Officer will conduct an ORM review to consider weather factors, facilities, remote operating locations, vehicle and flightline operations. This review will be summarized in a safety briefing prior to startex."}]
[]
[null,"B.",{"$f":"IF(OPlan!C101=0,\"Not Used\",+OPlan!C101)","v":"Crew experience with expected weather conditions will be considered when assembling crews and/or ground teams.  ALCON should be mindful of spring weather conditions and potential for spring storms and have contingency plan."}]
[]
[null,"C.",{"$f":"IF(OPlan!C103=0,\"Not Used\",+OPlan!C103)","v":"Ground Team leaders will stress safety during dismounted operations in proximity to roadways, parking areas, and within the target area. All members will wear reflective vests when dismounted from vehicles. "}]
[]
[null,"D.",{"$f":"IF(OPlan!C105=0,\"Not Used\",+OPlan!C105)","v":"Ground team members will use caution when operating on rural roadways with narrow shoulders to avoid traffic."}]
[]
[null,"E.",{"$f":"IF(OPlan!C107=0,\"Not Used\",+OPlan!C107)","v":"If a CAP flight line is used, qualified flightline supervisors will be present.  Supervisors and trainees shall consider the traffic density and activity in ramp area to avoid positioning trainees in hazardous positions."}]
[]
[null,"F.",{"$f":"IF(OPlan!C109=0,\"Not Used\",+OPlan!C109)","v":"To address the potential for fire when starting aircraft, a fire extinguisher(s) shall be present on the flight line during operations."}]
[]
[null,"G.",{"$f":"IF(OPlan!C111=0,\"Not Used\",+OPlan!C111)","v":"MSO will provide a safety briefing to IC and Operations prior to any vehicle release. IC and/or Operations will brief driver before release is given. Briefing will include any adverse WX and road conditions to avoid. "}]
[]
[null,"H.",{"$f":"IF(OPlan!C113=0,\"Not Used\",+OPlan!C113)","v":"All flights will be IAW restrictions in 60-1"}]
[]
[]
["WMIRS SUBMISSION (Page 2)"]
["9. SORTIE AND COST SUMMARY",null,null,null,null,null,null,null,null,null,null,null,null,null,null,null,null,null,"Projected OPlan Cost:",null,null,null,null,null,null,null,{"$f":"+OPlan!AA50","v":0}]
[]
[null,"A. Air",null,null,"Fuel Price:",null,null,null,{"$f":"+OPlan!I52","v":0},null,"/gal",null,null,null,"Total Hours:",null,null,null,{"$f":"+OPlan!S52","v":" "},null,null,null,"Total Cost:",null,null,null,{"$f":"+OPlan!AA52","v":0}]
[]
[null,null,null,null,"C-172",null,null,null,null,null,null,null,null,"C-182",null,null,null,null,null,null,null,null,"Other"]
[null,null,null,null,"# of Sorties",null,"Total Hours",null,"Fuel Burn",null,"Total",null,null,"# of Sorties",null,"Total Hours",null,"Fuel Burn",null,"Total",null,null,"# of Sorties",null,"Total Hours",null,"Fuel Burn",null,"Total"]
[]
[null,null,null,null,null,null,null,null,"Gal/Hr",null,null,null,null,null,null,null,null,"Gal/Hr",null,null,null,null,null,null,null,null,"Gal/Hr"]
["1. Ferry",null,null,null,{"$f":"+OPlan!D58","v":0},null,{"$f":"+OPlan!F58","v":0},null,9,null,{"$f":"+G65*I65*$I$52","v":0},null,null,{"$f":"+OPlan!M58","v":0},null,{"$f":"+OPlan!O58","v":0},null,11,null,{"$f":"+OPlan!S58","v":0},null,null,{"$f":"+OPlan!V58","v":0},null,{"$f":"+OPlan!X58","v":0},null,{"$f":"+OPlan!Z58","v":0},null,{"$f":"+Y65*AA65*$I$52","v":0}]
["2. Mission",null,null,null,{"$f":"+OPlan!D59","v":0},null,{"$f":"+OPlan!F59","v":0},null,9,null,{"$f":"+G66*I66*$I$52","v":0},null,null,{"$f":"+OPlan!M59","v":0},null,{"$f":"+OPlan!O59","v":0},null,11,null,{"$f":"+OPlan!S59","v":0},null,null,{"$f":"+OPlan!V59","v":0},null,{"$f":"+OPlan!X59","v":0},null,{"$f":"+OPlan!Z59","v":0},null,{"$f":"+Y66*AA66*$I$52","v":0}]
["3. Totals",null,null,null,{"$f":"SUM(E65:F66)","v":0},null,{"$f":"SUM(G65:H66)","v":0},null,null,null,{"$f":"K65+K66","v":0},null,null,{"$f":"SUM(N65:O66)","v":0},null,{"$f":"SUM(P65:Q66)","v":0},null,null,null,{"$f":"+OPlan!S60","v":0},null,null,{"$f":"SUM(W65:X66)","v":0},null,{"$f":"SUM(Y65:Z66)","v":0},null,null,null,{"$f":"AC65+AC66","v":0}]
[]
[null,"B.Ground",null,null,"Fuel Price:",null,null,null,{"$f":"+OPlan!I62","v":3.25},null,"/gal",null,null,null,"Total Miles:",null,null,null,{"$f":"+OPlan!S62","v":0},null,null,null,"Total Cost:",null,null,null,{"$f":"+OPlan!AA62","v":0}]
[]
[null,null,null,null,"Vans",null,null,null,null,null,null,null,null,"Pickup",null,null,null,null,null,null,null,null,"Other COV"]
[null,null,null,null,"# of Sorties",null,"Total Miles",null,"MPG",null,"Total",null,null,"# of Sorties",null,"Total Miles",null,"MPG",null,"Total",null,null,"# of Sorties",null,"Total Miles",null,"MPG",null,"Total"]
[]
[]
["1. Ferry",null,null,null,{"$f":"+OPlan!D68","v":0},null,{"$f":"+OPlan!F68","v":0},null,{"$f":"+OPlan!H68","v":10},null,{"$f":"+OPlan!J68","v":0},null,null,{"$f":"+OPlan!M68","v":0},null,{"$f":"+OPlan!O68","v":0},null,{"$f":"+OPlan!Q68","v":12},null,{"$f":"+OPlan!S68","v":0},null,null,{"$f":"+OPlan!V68","v":0},null,{"$f":"+OPlan!X68","v":0},null,{"$f":"+OPlan!Z68","v":0},null,{"$f":"+OPlan!AB68","v":" "}]
["2. Mission",null,null,null,{"$f":"+OPlan!D69","v":0},null,{"$f":"+OPlan!F69","v":0},null,{"$f":"+OPlan!H69","v":10},null,{"$f":"+OPlan!J69","v":0},null,null,{"$f":"+OPlan!M69","v":0},null,{"$f":"+OPlan!O69","v":0},null,{"$f":"+OPlan!Q69","v":12},null,{"$f":"+OPlan!S69","v":0},null,null,{"$f":"+OPlan!V69","v":0},null,{"$f":"+OPlan!X69","v":0},null,{"$f":"+OPlan!Z69","v":0},null,{"$f":"+OPlan!AB69","v":" "}]
["3. Totals",null,null,null,{"$f":"SUM(E75:F76)","v":0},null,{"$f":"SUM(G75:H76)","v":0},null,null,null,{"$f":"SUM(K75:L76)","v":0},null,null,{"$f":"SUM(N75:O76)","v":0},null,{"$f":"SUM(P75:Q76)","v":0},null,null,null,{"$f":"SUM(T75:U76)","v":0},null,null,{"$f":"SUM(W75:X76)","v":0},null,{"$f":"SUM(Y75:Z76)","v":0},null,null,null,{"$f":"SUM(AC75:AD76)","v":0}]
[null,null,null,null,null,null,null,null,null,null,null,null,null,"POV [see block 12(C)7]"]
[null,null,null,null,null,null,null,null,null,null,null,null,null,"# of Sorties",null,"Total Miles",null,"MPG",null,"Total"]
[]
[]
[null,null,null,null,null,null,null,null,null,null,"1. Ferry",null,null,{"$f":"+OPlan!M75","v":0},null,{"$f":"+OPlan!O75","v":0},null,{"$f":"+OPlan!Q75","v":0},null,{"$f":"+OPlan!S75","v":" "}]
[null,null,null,null,null,null,null,null,null,null,"2. Mission",null,null,{"$f":"+OPlan!M76","v":0},null,{"$f":"+OPlan!O76","v":0},null,{"$f":"+OPlan!Q76","v":0},null,{"$f":"+OPlan!S76","v":" "}]
[null,null,null,null,null,null,null,null,null,null,"3. Totals",null,null,{"$f":"SUM(N82:O83)","v":0},null,{"$f":"SUM(P82:Q83)","v":0},null,null,null,{"$f":"SUM(T82:U83)","v":0}]
[]
[]
[null,"C. Communications (Specify)",null,null,null,null,null,null,null,null,null,null,"Total:",null,{"$f":"+OPlan!O80","v":0}]
[null,null,null,"Trailer"]
[null,null,null,"Utilization (Days)",null,null,"$/day",null,null,"Tot. Oper. Hours",null,"$/hr"]
[]
[]
["1. Ferry",null,null,{"$f":"+OPlan!D85","v":0},null,null,{"$f":"+OPlan!G85","v":0},null,null,{"$f":"+OPlan!J85","v":0},null,{"$f":"+OPlan!L85","v":0},null,null,{"$f":"+OPlan!O85","v":0}]
["2. Mission",null,null,{"$f":"+OPlan!D86","v":1},null,null,null,null,null,{"$f":"+OPlan!J86","v":0},null,{"$f":"+OPlan!L86","v":0},null,null,{"$f":"+OPlan!O86","v":0}]
["3. Totals",null,null,{"$f":"+OPlan!D87","v":1},null,null,null,null,null,{"$f":"+OPlan!J87","v":0},null,{"$f":"+OPlan!L87","v":0},null,null,{"$f":"+OPlan!O87","v":0}]
[]
[null,null,null,"Expense",null,null,null,null,null,null,null,null,null,null,null,null,null,null,null,null,null,null,null,null,null,null,null,null,null,"Total Cost"]
[null,null,"4.",{"$f":"+OPlan!D90","v":"Aircard Internet access 3 days @ 15/day "},null,null,null,null,null,null,null,null,null,null,null,null,null,null,null,null,null,null,null,null,null,null,null,null,null,{"$f":"+OPlan!AD90","v":0}]
[null,null,"5.",{"$f":"+OPlan!D91","v":"Satellite Internet access (See section 11)"},null,null,null,null,null,null,null,null,null,null,null,null,null,null,null,null,null,null,null,null,null,null,null,null,null,{"$f":"+OPlan!AD91","v":0}]
[]
[null,"D. Other (Specify and Justify)",null,null,null,null,null,null,null,null,null,null,"Total:",null,{"$f":"+AD102+AD103","v":0}]
[null,null,null,"Expense",null,null,null,null,null,null,null,null,null,null,null,null,null,null,null,null,null,null,null,null,null,null,null,null,null,"Total Cost"]
[null,null,1,{"$f":"+OPlan!D95","v":0},null,null,null,null,null,null,null,null,null,null,null,null,null,null,null,null,null,null,null,null,null,null,null,null,null,{"$f":"+OPlan!AD95","v":0}]
[null,null,"2.",{"$f":"+OPlan!D96","v":0},null,null,null,null,null,null,null,null,null,null,null,null,null,null,null,null,null,null,null,null,null,null,null,null,null,{"$f":"+OPlan!AD96","v":0}]
[]
["WMIRS SUBMISSION (Page 3)"]
["11. Continuation"]
["Block"]
[]
[]
[{"$f":"IF(OPlan!A120=0,\" \",+OPlan!A120)","v":7},{"$f":"IF(OPlan!B120=0,\"Not Used \",OPlan!B120)","v":"Not Used "}]
[]
[null,{"$f":"IF(OPlan!B122=0,\"Not Used \",OPlan!B122)","v":"Not Used "}]
[]
[null,{"$f":"IF(OPlan!B124=0,\"Not Used \",OPlan!B124)","v":"BLANK"}]
[]
[null,{"$f":"IF(OPlan!B126=0,\"Not Used \",OPlan!B126)","v":"BLANK"}]
[]
[null,{"$f":"IF(OPlan!B128=0,\"Not Used \",OPlan!B128)","v":"BLANK"}]
[]
[null,{"$f":"IF(OPlan!B130=0,\"Not Used \",OPlan!B130)","v":"BLANK"}]
[]
[null,{"$f":"IF(OPlan!B132=0,\"Not Used \",OPlan!B132)","v":"BLANK"}]
[]
[null,{"$f":"IF(OPlan!B134=0,\"Not Used \",OPlan!B134)","v":"BLANK"}]
[]
[null,{"$f":"IF(OPlan!B136=0,\"Not Used \",OPlan!B136)","v":"BLANK"}]
[]
[null,{"$f":"IF(OPlan!B138=0,\"Not Used \",OPlan!B138)","v":"BLANK"}]
[]
[null,{"$f":"IF(OPlan!B140=0,\"Not Used \",OPlan!B140)","v":"BLANK"}]
[]
[null,{"$f":"IF(OPlan!B142=0,\"Not Used \",OPlan!B142)","v":"BLANK"}]

{"sheet":"Metrics","index":4,"n_rows":4,"n_cols":1,"rows_kept":4,"cut":false,"hidden":false,"merged":[[3,0,43,36],[0,0,0,36],[1,0,2,36]]}
["ALABAMA WING CIVIL AIR PATROL"]
["MISSION METRICS"]
[]
["This Page Reserved for Future Use"]